{"text_format":"1","workbook":"xlsx","n_sheets":6,"sheets":["Instructions","Dashboard","Enter Local Program Data","View Program Data","Statewide","Calc"],"not_rendered":{"charts":6,"images":0,"macros":1,"external_links":0,"defined_names":3,"comments":0,"pivot_tables":0},"unopened":[],"bounds":{"document_bytes":16777216,"sheet_cells":100000,"rows_first":2000,"rows_last":500,"rows_between":2000,"halvings":0,"cell_chars":16384,"cell_head_chars":4096},"cells_cut":0,"cells_raw":0,"read":"whole","date_system":"1900"}

{"sheet":"Instructions","index":0,"n_rows":26,"n_cols":4,"rows_kept":26,"cut":false,"hidden":false,"merged":[[3,1,5,1],[10,2,13,2],[10,3,13,3]]}
[]
[null,"Tab name","What you do here","Can I edit anything in this tab?"]
[]
[null,"Dashboard","Select a local program","You can select the local program in cell C1 (at the top)"]
[null,null,"View the graphs associated with that program","You must enter the timeperiod to which all graphs/data are referring."]
[null,null,"Click the \"Create pdfs of all programs\" button to download all pdfs*"]
[]
[null,"View Program Data","Select a local program to view its data","You can select the local program in cell J1 (at the top)"]
[]
[null,"Enter Local Program Data","Enter data for all your local programs in yellow cells","Yes, please.  You can (and should) edit any yellow-background cell."]
[null,null,"Please note that all program names must be unique.  Duplicate program names are highlighted in red.  It is important to make program names unique if you plan to download pdf files because if two programs have the same name, only one pdf will be created for one of the duplicate programs.","It is recommended that you copy/PASTE-VALUES for any data you bring in from other sources in order to keep the formatting in this sheet."]
[]
[]
[]
[]
{"$rows_left_out":12}
{"sheet":"Dashboard","index":1,"n_rows":114,"n_cols":9,"rows_kept":114,"cut":false,"hidden":false,"merged":[[99,8,100,8],[65,7,66,7],[63,8,64,8],[65,8,66,8],[70,8,71,8],[85,8,86,8],[82,1,82,4],[45,1,45,4],[64,1,64,4],[81,1,81,4],[44,1,44,5],[46,1,46,4],[63,1,63,5],[62,1,62,4],[0,2,0,3],[1,2,1,3],[2,2,2,3],[43,1,43,4],[27,1,27,4],[1,0,1,1],[0,0,0,1],[2,0,2,1],[4,1,4,5],[5,1,5,4],[15,1,15,4],[16,1,16,4],[39,8,40,8],[57,8,58,8],[53,8,54,8],[76,8,77,8],[67,7,68,7],[67,8,68,8],[72,7,73,7],[72,8,73,8],[74,7,75,7],[74,8,75,8],[51,8,52,8],[55,8,56,8],[44,8,45,8],[46,8,47,8],[48,8,49,8],[48,7,49,7]]}
["Local Program Name: ",null,"Wise Kids",null,null,null,null,null,"NOTES"]
["Date Range (rolling 12-months): ",null,"July 1, 2016 - June 30, 2017"]
["Timestamp: ",null,{"$f":"IFERROR(VLOOKUP(C1,'Enter Local Program Data'!B:C,2,FALSE),\"\")","v":"2017-09-05"}]
[]
[null,"Percentage of Children Referred for EI Services Who Are Evaluated, Eligible, and Served"]
[null,{"$f":"\"Statewide and by \"&C1","v":"Statewide and by Wise Kids"},null,null,null,{"$f":"$C$2","v":"July 1, 2016 - June 30, 2017"}]
[]
[]
[null,null,null,null,null,null,null,null,{"$f":"IFERROR(\"• \"&Calc!M5*100&\"% of the children referred to \"&C1&\" are now receiving EI services, as compared to \"&Calc!M4*100&\"% of the children referred statewide who are now receiving EI services.\",\"% of the children referred to [LOCAL PROGRAM] are now receiving EI services, as compared to % of the children referred statewide who are now receiving EI services.\")","v":"• 93% of the children referred to Wise Kids are now receiving EI services, as compared to 80% of the children referred statewide who are now receiving EI services."}]
[null,null,null,null,null,null,null,null,{"$f":"IFERROR(\"• \"&100*Calc!L5&\"% of the children referred to \"&C1&\" were found eligible for EI services, as compared to \"&100*Calc!L4&\"% of the children referred statewide who were found eligible for EI services.\",\"% of the children referred to [LOCAL PROGRAM] were found eligible for EI services, as compared to % of the children referred statewide who were found eligible for EI services.\")","v":"• 93% of the children referred to Wise Kids were found eligible for EI services, as compared to 86% of the children referred statewide who were found eligible for EI services."}]
[null,null,null,null,null,null,null,null,{"$f":"IFERROR(\"• \"&100*Calc!K5&\"% of the children referred to \"&C1&\" were evaluated for EI services, as compared to \"&100*Calc!K4&\"% of the children referred statewide who were evaluated for EI services.\",\"% of the children referred to [LOCAL PROGRAM] were evaluated for EI services, as compared to % of the children referred statewide who were evaluated for EI services.\")","v":"• 93% of the children referred to Wise Kids were evaluated for EI services, as compared to 91% of the children referred statewide who were evaluated for EI services."}]
[null,null,null,null,null,null,null,null,{"$f":"\"• The Statewide Sum is based on information from \"&Statewide!G5&\" programs entered.\"","v":"• The Statewide Sum is based on information from 6 programs entered."}]
[]
[]
[]
{"$rows_left_out":100}
{"sheet":"Enter Local Program Data","index":2,"n_rows":200,"n_cols":40,"rows_kept":200,"cut":false,"hidden":false,"merged":[[0,1,2,1],[0,0,2,0],[1,10,2,10],[1,23,1,24],[1,21,1,22],[0,3,0,6],[0,7,0,8],[1,6,2,6],[1,5,2,5],[1,4,2,4],[1,3,2,3],[1,8,2,8],[1,7,2,7],[0,2,2,2],[1,12,2,12],[1,11,2,11],[1,15,2,15],[1,14,2,14],[1,13,2,13],[0,9,0,16],[1,16,2,16],[1,9,2,9],[0,38,0,39],[1,17,2,18],[1,19,2,20],[1,25,1,26],[0,21,0,36],[1,35,1,36],[0,17,0,20],[1,27,1,28],[1,33,1,34],[1,31,1,32],[1,29,1,30]]}
["Program Number","Local Program Name","Timestamp","Children Served (EI)",null,null,null,"Expenses",null,"Budget by Source",null,null,null,null,null,null,null,"Percent of Children Enrolled",null,null,null,"Receipts by Source",null,null,null,null,null,null,null,null,null,null,null,null,null,null,null,null,"PERCENT OF FUNDING"]
[null,null,null,"Referred","Evaluated","Eligible","Served","Infrastructure & Administrative","Direct Services","Local Funds","Family Fees","CHIP","Private Insurance","Federal Part C","State Part C","State General Funds","Medicaid","Private Insurance",null,"Medicaid",null,"Local Funds",null,"Family Fees",null,"CHIP",null,"Private Insurance",null,"Federal Part C",null,"State Part C",null,"State General Funds",null,"Medicaid",null,null,"M / sum(J:Q)","Q / sum(J:Q)"]
[null,null,null,null,null,null,null,null,null,null,null,null,null,null,null,null,null,null,null,null,null,"Current","Anticipated","Current","Anticipated","Current","Anticipated","Current","Anticipated","Current","Anticipated","Current","Anticipated","Current","Anticipated","Current","Anticipated",null,"Private Insurance","Medicaid"]
[{"$f":"IF(A1=$A$1,IF(B4=\"\",0,1),IF(B4=\"\",A1,A1+1))","v":1},"Happy Kids","2017-06-01",100,78,62,60,2345000,3460000,2940,9800,134553.01999999999,1709290.2529500001,735000,780599.64500000002,980041.16,4628927.0999999996,0.3,null,0.59,null,1500,1500,5000,5000,96109,41190,112500,37500,637500,112500,637224,159306,870037,130005,2429041,607260,null,{"$f":"IFERROR(ROUND(M4/SUM(J4:Q4),2),\"-\")","v":0.19},{"$f":"IFERROR(ROUND(Q4/SUM(J4:Q4),2),\"-\")","v":0.52}]
[{"$f":"IF(A4=$A$1,IF(B5=\"\",0,1),IF(B5=\"\",A4,A4+1))","v":2},"Creative Kids","2017-06-02",150,149,149,85,1234567,2345678,3840,10560,122207.03999999999,4025860.7502959999,739200,774269.03999999992,961000.32,6545915.6263679992,0.5,null,0.51,null,6000,4000,7000,7000,106109,40190,102500,47500,657500,102500,639224,154306,820037,150005,2529041,603260,null,{"$f":"IFERROR(ROUND(M5/SUM(J5:Q5),2),\"-\")","v":0.31},{"$f":"IFERROR(ROUND(Q5/SUM(J5:Q5),2),\"-\")","v":0.5}]
[3,"Inventive Kids","2017-06-03",20,10,5,2,234567,345678,2760,11040,107915.08,3093186.6393750003,726800,751207.83000000007,921878.64,6826695.8490000004,0.25,null,0.77,null,7000,3000,9000,9000,116109,39190,92500,57500,677500,92500,641224,149306,770037,170005,2629041,599260,null,0.25,0.55000000000000004]
[4,"Ingenius Kids","2017-06-04",900,800,700,600,345678,456789,1700,11050,91204.15,3045793.1119850003,688500,702550.71250000002,852585.7,5448312.8419000003,0.4,null,0.44,null,8000,2000,11000,11000,126109,38190,82500,67500,697500,82500,643224,144306,720037,190005,2729041,595260,null,0.28000000000000003,0.5]
[5,"Energized Kids","2017-06-01",700,650,650,650,1212121,2121212,11250,9000,147750,2910144.1611937503,622500,627397.6875,753031.5,6738033.9217312504,0.42,null,0.55000000000000004,null,200000,100000,150000,75000,100000,50000,50000,25000,40000,50000,30000,75000,20000,76000,10000,77000,null,0.25,0.56999999999999995]
[6,"Wise Kids","2017-09-05",700,650,650,650,1212121,2121212,7500,6000,98500,5557240.5388500001,415000,418265.125,502021,2979260.4514000001,0.8,null,0.27,null,200000,100000,150000,75000,100000,50000,50000,25000,40000,50000,30000,75000,20000,76000,10000,77000,null,0.56000000000000005,0.3]
[6,null,null,null,null,null,null,null,null,null,null,null,null,null,null,null,null,null,null,null,null,null,null,null,null,null,null,null,null,null,null,null,null,null,null,null,null,null,"-","-"]
[6,null,null,null,null,null,null,null,null,null,null,null,null,null,null,null,null,null,null,null,null,null,null,null,null,null,null,null,null,null,null,null,null,null,null,null,null,null,"-","-"]
[6,null,null,null,null,null,null,null,null,null,null,null,null,null,null,null,null,null,null,null,null,null,null,null,null,null,null,null,null,null,null,null,null,null,null,null,null,null,"-","-"]
[6,null,null,null,null,null,null,null,null,null,null,null,null,null,null,null,null,null,null,null,null,null,null,null,null,null,null,null,null,null,null,null,null,null,null,null,null,null,"-","-"]
[6,null,null,null,null,null,null,null,null,null,null,null,null,null,null,null,null,null,null,null,null,null,null,null,null,null,null,null,null,null,null,null,null,null,null,null,null,null,"-","-"]
[6,null,null,null,null,null,null,null,null,null,null,null,null,null,null,null,null,null,null,null,null,null,null,null,null,null,null,null,null,null,null,null,null,null,null,null,null,null,"-","-"]
{"$rows_left_out":186}
{"sheet":"View Program Data","index":3,"n_rows":36,"n_cols":37,"rows_kept":36,"cut":false,"hidden":false,"merged":[[0,0,0,8],[1,0,1,8],[0,9,0,22],[1,9,1,22],[2,0,2,8],[2,9,2,22],[5,11,5,13],[5,14,5,16],[5,17,5,19],[5,20,5,22],[21,32,21,36],[21,20,21,24],[10,11,10,16],[10,17,10,22],[16,1,16,4],[16,9,16,12],[16,13,16,17],[16,18,16,21],[16,22,16,25],[16,26,16,31],[13,2,13,10],[16,5,16,8],[21,8,21,12],[21,13,21,17],[21,27,21,31],[16,32,16,35],[16,36,16,39],[13,11,13,16],[13,17,13,22],[18,32,18,35],[18,26,18,31],[6,14,6,16],[6,17,6,19],[6,20,6,22],[11,11,11,16],[11,17,11,22],[12,11,12,16],[12,17,12,22],[17,22,17,25],[18,22,18,25],[18,18,18,21],[18,13,18,17],[18,9,18,12],[11,2,11,10],[12,2,12,10],[7,11,7,13],[7,14,7,16],[7,17,7,19],[7,20,7,22],[18,1,18,4],[6,2,6,10],[7,2,7,10],[6,11,6,13],[21,1,21,5],[20,1,20,39],[22,1,22,7],[23,1,23,7],[22,20,22,26],[23,20,23,26],[17,26,17,31],[17,32,17,35],[17,36,17,39],[18,36,18,39],[17,5,17,8],[18,5,18,8],[22,32,22,36],[23,32,23,36],[22,8,22,12],[23,8,23,12],[22,13,22,17],[23,13,23,17],[22,27,22,31],[23,27,23,31],[17,1,17,4],[17,9,17,12],[17,13,17,17],[17,18,17,21],[31,1,31,6],[31,7,31,10],[31,11,31,14],[28,1,28,6],[28,7,28,10],[28,11,28,14],[28,15,28,18],[26,7,26,10],[26,11,26,14],[26,15,26,18],[31,15,31,18],[27,1,27,6],[27,7,27,10],[27,11,27,14],[27,15,27,18],[29,1,29,6],[29,7,29,10],[29,11,29,14],[29,15,29,18],[30,1,30,6],[30,7,30,10],[30,11,30,14],[30,15,30,18],[35,1,35,6],[35,7,35,10],[35,11,35,14],[35,15,35,18],[32,1,32,6],[32,7,32,10],[32,11,32,14],[32,15,32,18],[33,1,33,6],[33,7,33,10],[33,11,33,14],[33,15,33,18],[34,1,34,6],[34,7,34,10],[34,11,34,14],[34,15,34,18]]}
["Select Local Program Name: ",null,null,null,null,null,null,null,null,"Inventive Kids"]
["Date Range (rolling 12-months): ",null,null,null,null,null,null,null,null,{"$f":"Dashboard!C2","v":"July 1, 2016 - June 30, 2017"}]
["Timestamp: ",null,null,null,null,null,null,null,null,{"$f":"IFERROR(VLOOKUP(J1,'Enter Local Program Data'!B:C,2,FALSE),\"\")","v":"2017-06-03"}]
[]
[null,{"$f":"\"Percentage of Children Referred for EI Services Who Are Evaluated, Eligible, and Served Statewide and by \"&J1","v":"Percentage of Children Referred for EI Services Who Are Evaluated, Eligible, and Served Statewide and by Inventive Kids"}]
[null,null,null,null,null,null,null,null,null,null,null,"Referred",null,null,"Evaluated",null,null,"Eligible",null,null,"Served"]
[null,null,"Statewide",null,null,null,null,null,null,null,null,{"$f":"Statewide!C4","v":2570},null,null,{"$f":"Statewide!D4","v":2337},null,null,{"$f":"Statewide!E4","v":2216},null,null,{"$f":"Statewide!F4","v":2047}]
[null,null,{"$f":"J1","v":"Inventive Kids"},null,null,null,null,null,null,null,null,{"$f":"IFERROR(VLOOKUP($J$1,'Enter Local Program Data'!B:G,3,FALSE),0)","v":20},null,null,{"$f":"IFERROR(VLOOKUP($J$1,'Enter Local Program Data'!B:G,4,FALSE),0)","v":10},null,null,{"$f":"IFERROR(VLOOKUP($J$1,'Enter Local Program Data'!B:G,5,FALSE),0)","v":5},null,null,{"$f":"IFERROR(VLOOKUP($J$1,'Enter Local Program Data'!B:G,6,FALSE),0)","v":2}]
[]
[null,{"$f":"\"Total Expenses by Type for Statewide Average and \"&J1&\" Infrastructure and Administrative Versus Direct Services\"","v":"Total Expenses by Type for Statewide Average and Inventive Kids Infrastructure and Administrative Versus Direct Services"}]
[null,null,null,null,null,null,null,null,null,null,null,{"$f":"J1","v":"Inventive Kids"},null,null,null,null,null,"Statewide Average"]
[null,null,"Infrastructure and Administrative",null,null,null,null,null,null,null,null,{"$f":"IFERROR(VLOOKUP(J1,'Enter Local Program Data'!B:I,7,FALSE),0)","v":234567},null,null,null,null,null,{"$f":"IFERROR(Statewide!G6,0)","v":1097342.3333333333}]
[null,null,"Direct Services",null,null,null,null,null,null,null,null,{"$f":"IFERROR(VLOOKUP(J1,'Enter Local Program Data'!B:I,8,FALSE),0)","v":345678},null,null,null,null,null,{"$f":"IFERROR(Statewide!H6,0)","v":1808428.1666666667}]
[null,null,"Total",null,null,null,null,null,null,null,null,{"$f":"L12+L13","v":580245},null,null,null,null,null,{"$f":"R12+R13","v":2905770.5}]
[]
{"$rows_left_out":22}
{"sheet":"Statewide","index":4,"n_rows":6,"n_cols":13,"rows_kept":6,"cut":false,"hidden":true,"merged":[[1,9,1,10],[1,11,1,12],[0,2,0,5],[0,6,0,7],[1,2,2,2],[1,3,2,3],[1,4,2,4],[1,5,2,5],[1,6,2,6],[1,7,2,7]]}
[null,null,"Children Served (EI)",null,null,null,"Expenses"]
[null,"Statewide","Referred","Evaluated","Eligible","Served","Infrastructure and Administrative","Direct Services",null,"Statewide Private Insurance",null,"Statewide Medicaid"]
[null,null,null,null,null,null,null,null,null,"Percent of Children Enrolled","Percent of Funding Budgeted","Percent of Children Enrolled","Percent of Funding Budgeted"]
[null,"Sum",{"$f":"SUM('Enter Local Program Data'!D:D)","v":2570},{"$f":"SUM('Enter Local Program Data'!E:E)","v":2337},{"$f":"SUM('Enter Local Program Data'!F:F)","v":2216},{"$f":"SUM('Enter Local Program Data'!G:G)","v":2047},{"$f":"SUM('Enter Local Program Data'!H:H)","v":6584054},{"$f":"SUM('Enter Local Program Data'!I:I)","v":10850569},null,{"$f":"ROUND(AVERAGE('Enter Local Program Data'!R:R),2)","v":0.45},{"$f":"ROUND(AVERAGE('Enter Local Program Data'!AM:AM),2)","v":0.31},{"$f":"ROUND(AVERAGE('Enter Local Program Data'!T:T),2)","v":0.52},{"$f":"ROUND(AVERAGE('Enter Local Program Data'!AN:AN),2)","v":0.49}]
[null,"Count",null,null,null,null,{"$f":"COUNTA('Enter Local Program Data'!G4:G1102)","v":6},{"$f":"COUNTA('Enter Local Program Data'!H4:H1102)","v":6},null,null,{"$f":"COUNT('Enter Local Program Data'!AM:AM)","v":6},null,{"$f":"COUNT('Enter Local Program Data'!AN:AN)","v":6}]
[null,"Average",null,null,null,null,{"$f":"G4/G5","v":1097342.3333333333},{"$f":"H4/H5","v":1808428.1666666667}]

{"sheet":"Calc","index":5,"n_rows":54,"n_cols":20,"rows_kept":54,"cut":false,"hidden":true,"merged":[]}
[null,null,null,null,null,null,null,null,"ProgramName: ",{"$f":"Dashboard!C1","v":"Wise Kids"}]
[1,{"$f":"\"Percent of Children Referred for EI Services who are Evaluated, Eligible, and Served Statewide and by \"&J1","v":"Percent of Children Referred for EI Services who are Evaluated, Eligible, and Served Statewide and by Wise Kids"},null,null,null,null,null,null,null,"internal page calc"]
["Data source",null,null,"Referred for EI Services","Evaluated","Eligible","Served",null,null,"Referred for EI Services","Evaluated","Eligible","Served"]
["Statewide",null,"Statewide",{"$f":"Statewide!C4","v":2570},{"$f":"Statewide!D4","v":2337},{"$f":"Statewide!E4","v":2216},{"$f":"Statewide!F4","v":2047},null,"Statewide",{"$f":"ROUND(D4/$D4,2)","v":1},0.91,0.86,0.8]
["Enter Local Program Data",null,"Local",{"$f":"IFERROR(VLOOKUP($J$1,'Enter Local Program Data'!B:G,3,FALSE),0)","v":700},{"$f":"IFERROR(VLOOKUP($J$1,'Enter Local Program Data'!B:G,4,FALSE),0)","v":650},{"$f":"IFERROR(VLOOKUP($J$1,'Enter Local Program Data'!B:G,5,FALSE),0)","v":650},{"$f":"IFERROR(VLOOKUP($J$1,'Enter Local Program Data'!B:G,6,FALSE),0)","v":650},null,{"$f":"Dashboard!$C$1","v":"Wise Kids"},1,0.93,0.93,0.93]
[]
[2,{"$f":"\"Total Expenses by Type for Statewide Average and \"&J1&\"Infrastructure & Administrative vs. Direct Services\"","v":"Total Expenses by Type for Statewide Average and Wise KidsInfrastructure & Administrative vs. Direct Services"},null,"Enter Local Program Data","Statewide",null,null,null,null,"internal page calc"]
[null,null,null,{"$f":"Dashboard!C1","v":"Wise Kids"},"Statewide Average",null,null,null,null,{"$f":"Dashboard!$C$1","v":"Wise Kids"},"Statewide Average"]
[null,null,"Infrastructure and Administrative",{"$f":"IFERROR(ROUND(VLOOKUP(J1,'Enter Local Program Data'!B:I,7,FALSE),0),0)","v":1212121},{"$f":"IFERROR(ROUND(Statewide!G6,0),0)","v":1097342},null,null,null,"Infrastructure and Administrative",{"$f":"ROUND(D9/SUM(D9:D10),2)","v":0.36},{"$f":"ROUND(E9/SUM(E9:E10),2)","v":0.38}]
[null,null,"Direct Services",{"$f":"IFERROR(ROUND(VLOOKUP(J1,'Enter Local Program Data'!B:I,8,FALSE),0),0)","v":2121212},{"$f":"IFERROR(ROUND(Statewide!H6,0),0)","v":1808428},null,null,null,"Direct Services",{"$f":"ROUND(D10/SUM(D9:D10),2)","v":0.64},{"$f":"ROUND(E10/SUM(E9:E10),2)","v":0.62}]
[null,null,null,null,null,null,null,null,null,null,null,null,null,null,null,null,null,null,"Enter Local Program Data"]
[null,null,null,null,null,null,null,null,null,null,null,null,null,"This chart sorts categories into least to greatest for display purposes"]
[3,{"$f":"\"Budget by Funding Source for \"&J1","v":"Budget by Funding Source for Wise Kids"},null,"Info pulled from chart to the right",null,null,null,null,null,null,null,null,null,{"$f":"RANK(S13,$S$13:$S$20,0)","v":7},{"$f":"COUNTIFS($N$13:$N13,N13)","v":1},{"$f":"N13*10+O13","v":71},{"$f":"RANK(P13,$P$13:$P$20,0)","v":2},"Local Funds",{"$f":"VLOOKUP(J1,'Enter Local Program Data'!B:Q,9,FALSE)","v":7500},{"$f":"IFERROR(S13/$S$21,\"-\")","v":7.5121794098994014E-4}]
[null,"Int Calculation field",1,2,3,4,5,6,7,8,"Total",null,null,8,{"$f":"COUNTIFS($N$13:$N14,N14)","v":1},{"$f":"N14*10+O14","v":81},1,"Family Fees",{"$f":"VLOOKUP(J1,'Enter Local Program Data'!B:Q,10,FALSE)","v":6000},6.0097435279195211E-4]
[null,null,{"$f":"IFERROR(VLOOKUP(C14,$Q$13:$T$20,3,FALSE),0)","v":6000},7500,98500,415000,418265.125,502021,2979260.4514000001,5557240.5388500001,{"$f":"SUM(C15:J15)","v":9983787.1152500007},null,null,6,{"$f":"COUNTIFS($N$13:$N15,N15)","v":1},{"$f":"N15*10+O15","v":61},3,"CHIP",{"$f":"VLOOKUP(J1,'Enter Local Program Data'!B:Q,11,FALSE)","v":98500},9.8659956250012146E-3]
{"$rows_left_out":39}